Test run details - MTFirstReleaseAppOnly - 12/7/2017 3:57:06 AM

Failed Tests | Skipped Tests | Notfound Tests | Passed Tests

Failed tests
Result Test      Search Duration Error
OfficeDevPnP.Core.Tests.Sites.SiteCollectionTests.CreateCommunicationSiteTestAsync 00:00:03 Test method OfficeDevPnP.Core.Tests.Sites.SiteCollectionTests.CreateCommunicationSiteTestAsync threw exception: System.Exception: {"d":{"Create":{"__metadata":{"type":"SP.Publishing.CommunicationSiteCreationResponse"},"SiteStatus":3,"SiteUrl":""}}}
OfficeDevPnP.Core.Tests.Sites.ALMTests.InstallUninstallTestAsync 00:00:02 Test method OfficeDevPnP.Core.Tests.Sites.ALMTests.InstallUninstallTestAsync threw exception: System.Exception: {"error":{"code":"-1, Microsoft.SharePoint.Client.ResourceNotFoundException","message":{"lang":"en-US","value":"Exception of type 'Microsoft.SharePoint.Client.ResourceNotFoundException' was thrown."}}}
OfficeDevPnP.Core.Tests.Sites.ALMTests.AddRemoveAppTest 00:00:03 Test method OfficeDevPnP.Core.Tests.Sites.ALMTests.AddRemoveAppTest threw exception: System.Exception: {"error":{"code":"-1, Microsoft.SharePoint.Client.ResourceNotFoundException","message":{"lang":"en-US","value":"Exception of type 'Microsoft.SharePoint.Client.ResourceNotFoundException' was thrown."}}}
OfficeDevPnP.Core.Tests.Sites.ALMTests.AddRemoveAppTestAsync 00:00:03 Test method OfficeDevPnP.Core.Tests.Sites.ALMTests.AddRemoveAppTestAsync threw exception: System.Exception: {"error":{"code":"-1, Microsoft.SharePoint.Client.ResourceNotFoundException","message":{"lang":"en-US","value":"Exception of type 'Microsoft.SharePoint.Client.ResourceNotFoundException' was thrown."}}}
OfficeDevPnP.Core.Tests.Framework.Functional.ListTests.Web1705ListAddingTest 00:00:45 Assert.IsTrue failed.
OfficeDevPnP.Core.Tests.Framework.Functional.ListTests.SiteCollection1705ListAddingTest 00:00:55 Assert.IsTrue failed.
OfficeDevPnP.Core.Tests.Framework.Functional.ListNoScriptTests.Web1705ListAddingTest 00:01:02 Assert.IsTrue failed.
OfficeDevPnP.Core.Tests.Framework.Functional.ListNoScriptTests.SiteCollection1705ListAddingTest 00:01:15 Assert.IsTrue failed.
OfficeDevPnP.Core.Tests.Framework.ObjectHandlers.ObjectSupportedUILanguagesTests.CanExtractSupportedUILanguages 00:00:01 Assert.IsTrue failed.
Page 1 of 1

Skipped tests
Result Test      Search Duration Error
OfficeDevPnP.Core.Tests.AppModelExtensions.TenantExtensionsTests.GetUserProfileServiceClientTest 00:00:00 Assert.Inconclusive failed. Web service tests are not supported when testing using app-only
OfficeDevPnP.Core.Tests.AppModelExtensions.TenantExtensionsTests.GetOneDriveSiteCollectionsTest 00:00:00 Assert.Inconclusive failed. Web service tests are not supported when testing using app-only
OfficeDevPnP.Core.Tests.AppModelExtensions.FileFolderExtensionsTests.UploadFileWebDavTest 00:00:02 Assert.Inconclusive failed. Tests involving webdav are not supported when testing using app-only
OfficeDevPnP.Core.Tests.AppModelExtensions.SearchExtensionsTests.TestSiteSearchTest 00:00:00 Assert.Inconclusive failed. Search tests are not supported when testing using app-only
OfficeDevPnP.Core.Tests.AppModelExtensions.SearchExtensionsTests.GetSearchConfigurationFromSiteTest 00:00:00 Assert.Inconclusive failed. Search tests are not supported when testing using app-only
OfficeDevPnP.Core.Tests.AppModelExtensions.SearchExtensionsTests.GetSearchConfigurationFromWebTest 00:00:00 Assert.Inconclusive failed. Search tests are not supported when testing using app-only
OfficeDevPnP.Core.Tests.AppModelExtensions.SearchExtensionsTests.SetSiteCollectionSearchCenterUrlTest 00:00:00 Assert.Inconclusive failed. Search tests are not supported when testing using app-only
OfficeDevPnP.Core.Tests.Framework.Functional.SearchSettingTests.Web1605SearchSettingsTest 00:00:00 Assert.Inconclusive failed. Test that require search settings are not supported in app-only.
OfficeDevPnP.Core.Tests.Framework.Functional.SearchSettingTests.SiteCollection1605SearchSettingsTest 00:00:00 Assert.Inconclusive failed. Test that require search settings are not supported in app-only.
OfficeDevPnP.Core.Tests.Framework.Functional.TermGroupTests.WebTermGroupTest 00:00:00 Assert.Inconclusive failed. Test that require taxonomy creation are not supported in app-only.
Page 1 of 6

Notfound tests
Result Test Duration Error
No data found