Test run details - MTFirstReleaseCredentials - 12/6/2017 8:59:09 PM

Failed Tests | Skipped Tests | Notfound Tests | Passed Tests

Failed tests
Result Test      Search Duration Error
OfficeDevPnP.Core.Tests.Sites.ALMTests.InstallUninstallTestAsync 00:00:08 Test method OfficeDevPnP.Core.Tests.Sites.ALMTests.InstallUninstallTestAsync threw exception: System.Exception: {"odata.error":{"code":"-1, System.InvalidOperationException","message":{"lang":"en-US","value":"Another job exists for this app instance. Please retry after that job is done."}}}
OfficeDevPnP.Core.Tests.Framework.Functional.ListTests.Web1705ListAddingTest 00:00:46 Assert.IsTrue failed.
OfficeDevPnP.Core.Tests.Framework.Functional.ListTests.SiteCollection1705ListAddingTest 00:00:53 Assert.IsTrue failed.
OfficeDevPnP.Core.Tests.Framework.Functional.ListNoScriptTests.Web1705ListAddingTest N/A Class Initialization method OfficeDevPnP.Core.Tests.Framework.Functional.ListNoScriptTests.ClassInit threw exception. System.Threading.ThreadAbortException: System.Threading.ThreadAbortException: Thread was being aborted..
OfficeDevPnP.Core.Tests.Framework.Functional.ListNoScriptTests.Web1605ListAddingTest N/A Class Initialization method OfficeDevPnP.Core.Tests.Framework.Functional.ListNoScriptTests.ClassInit threw exception. System.Threading.ThreadAbortException: System.Threading.ThreadAbortException: Thread was being aborted..
OfficeDevPnP.Core.Tests.Framework.Functional.ListNoScriptTests.WebListAddingTest N/A Class Initialization method OfficeDevPnP.Core.Tests.Framework.Functional.ListNoScriptTests.ClassInit threw exception. System.Threading.ThreadAbortException: System.Threading.ThreadAbortException: Thread was being aborted..
OfficeDevPnP.Core.Tests.Framework.Functional.ListNoScriptTests.SiteCollection1705ListAddingTest N/A Class Initialization method OfficeDevPnP.Core.Tests.Framework.Functional.ListNoScriptTests.ClassInit threw exception. System.Threading.ThreadAbortException: System.Threading.ThreadAbortException: Thread was being aborted..
OfficeDevPnP.Core.Tests.Framework.Functional.ListNoScriptTests.SiteCollection1605ListAddingTest N/A Test 'SiteCollection1605ListAddingTest' exceeded execution timeout period.
OfficeDevPnP.Core.Tests.Framework.Functional.ListNoScriptTests.SiteCollectionListAddingTest N/A Test 'SiteCollectionListAddingTest' exceeded execution timeout period.
OfficeDevPnP.Core.Tests.Framework.Functional.ContentTypeNoScriptTests.SiteCollectionContentTypeAddingTest N/A Test 'SiteCollectionContentTypeAddingTest' exceeded execution timeout period.
Page 1 of 2

Notfound tests
Result Test Duration Error
No data found