Test run details - MTFirstReleaseCredentials - 12/5/2017 8:58:43 PM

Failed Tests | Skipped Tests | Notfound Tests | Passed Tests

Failed tests
Result Test      Search Duration Error
OfficeDevPnP.Core.Tests.Sites.ALMTests.InstallUninstallTestAsync 00:00:04 Test method OfficeDevPnP.Core.Tests.Sites.ALMTests.InstallUninstallTestAsync threw exception: System.Exception: {"error":{"code":"-1, Microsoft.SharePoint.Client.ResourceNotFoundException","message":{"lang":"en-US","value":"Exception of type 'Microsoft.SharePoint.Client.ResourceNotFoundException' was thrown."}}}
OfficeDevPnP.Core.Tests.Sites.ALMTests.DeployRetractAppAsyncTest 00:00:02 Test method OfficeDevPnP.Core.Tests.Sites.ALMTests.DeployRetractAppAsyncTest threw exception: System.Exception: {"error":{"code":"-1, Microsoft.SharePoint.Client.ResourceNotFoundException","message":{"lang":"en-US","value":"Exception of type 'Microsoft.SharePoint.Client.ResourceNotFoundException' was thrown."}}}
OfficeDevPnP.Core.Tests.Sites.ALMTests.DeployRetractAppTest 00:00:03 Test method OfficeDevPnP.Core.Tests.Sites.ALMTests.DeployRetractAppTest threw exception: System.Exception: {"error":{"code":"-1, Microsoft.SharePoint.Client.ResourceNotFoundException","message":{"lang":"en-US","value":"Exception of type 'Microsoft.SharePoint.Client.ResourceNotFoundException' was thrown."}}}
OfficeDevPnP.Core.Tests.Sites.ALMTests.AddRemoveAppTest 00:00:03 Test method OfficeDevPnP.Core.Tests.Sites.ALMTests.AddRemoveAppTest threw exception: System.Exception: {"error":{"code":"-1, Microsoft.SharePoint.Client.ResourceNotFoundException","message":{"lang":"en-US","value":"Exception of type 'Microsoft.SharePoint.Client.ResourceNotFoundException' was thrown."}}}
OfficeDevPnP.Core.Tests.Sites.ALMTests.AddRemoveAppTestAsync 00:00:03 Test method OfficeDevPnP.Core.Tests.Sites.ALMTests.AddRemoveAppTestAsync threw exception: System.Exception: {"error":{"code":"-1, Microsoft.SharePoint.Client.ResourceNotFoundException","message":{"lang":"en-US","value":"Exception of type 'Microsoft.SharePoint.Client.ResourceNotFoundException' was thrown."}}}
OfficeDevPnP.Core.Tests.Framework.Functional.WorkflowsTests.SiteCollectionWorkflowsTest 00:00:11 Test method OfficeDevPnP.Core.Tests.Framework.Functional.WorkflowsTests.SiteCollectionWorkflowsTest threw exception: System.Exception: Referenced content type 0x0108003365C4474CAE8C42BCE396314E88E51F not available in site or in template
OfficeDevPnP.Core.Tests.Framework.Functional.LanguageTests.WebLanguageSettingsTest 00:00:06 Test method OfficeDevPnP.Core.Tests.Framework.Functional.LanguageTests.WebLanguageSettingsTest threw exception: System.NullReferenceException: Object reference not set to an instance of an object.
OfficeDevPnP.Core.Tests.Framework.Functional.LanguageTests.SiteCollectionLanguageSettingsTest 00:00:09 Test method OfficeDevPnP.Core.Tests.Framework.Functional.LanguageTests.SiteCollectionLanguageSettingsTest threw exception: System.NullReferenceException: Object reference not set to an instance of an object.
OfficeDevPnP.Core.Tests.Framework.Functional.NavigationTests.WebNavigationTest 00:00:24 Test method OfficeDevPnP.Core.Tests.Framework.Functional.NavigationTests.WebNavigationTest threw exception: System.NullReferenceException: Object reference not set to an instance of an object.
OfficeDevPnP.Core.Tests.Framework.Functional.NavigationTests.SiteCollectionNavigationTest 00:03:47 Test method OfficeDevPnP.Core.Tests.Framework.Functional.NavigationTests.SiteCollectionNavigationTest threw exception: System.NullReferenceException: Object reference not set to an instance of an object.
Page 1 of 3

Notfound tests
Result Test Duration Error
No data found