Test run details - AzureVMSP2016AppOnly - 12/5/2017 7:17:24 PM

Failed Tests | Skipped Tests | Notfound Tests | Passed Tests

Failed tests
Result Test      Search Duration Error
OfficeDevPnP.Core.Tests.Framework.Functional.LanguageTests.WebLanguageSettingsTest 00:00:04 Test method OfficeDevPnP.Core.Tests.Framework.Functional.LanguageTests.WebLanguageSettingsTest threw exception: System.NullReferenceException: Object reference not set to an instance of an object.
OfficeDevPnP.Core.Tests.Framework.Functional.LanguageTests.SiteCollectionLanguageSettingsTest 00:00:03 Test method OfficeDevPnP.Core.Tests.Framework.Functional.LanguageTests.SiteCollectionLanguageSettingsTest threw exception: System.NullReferenceException: Object reference not set to an instance of an object.
OfficeDevPnP.Core.Tests.Framework.Functional.LocalizationTest.WebLocalizationTest 00:00:17 Assert.IsTrue failed.
OfficeDevPnP.Core.Tests.Framework.Functional.LocalizationTest.SiteCollectionsLocalizationTest 00:00:27 Assert.IsTrue failed.
OfficeDevPnP.Core.Tests.Framework.ObjectHandlers.ObjectWorkflowsTests.UpdatWorkflowSubscription 00:00:02 Test method OfficeDevPnP.Core.Tests.Framework.ObjectHandlers.ObjectWorkflowsTests.UpdatWorkflowSubscription threw exception: Microsoft.SharePoint.Client.ServerException: Cannot invoke method or retrieve property from null object. Object returned by the following call stack is null. "GetWorkflowDeploymentService new Microsoft.SharePoint.WorkflowServices.WorkflowServicesManager() "
OfficeDevPnP.Core.Tests.Framework.ObjectHandlers.ObjectSupportedUILanguagesTests.CanExtractSupportedUILanguages 00:00:00 Assert.IsTrue failed.
OfficeDevPnP.Core.Tests.Framework.Providers.XMLProvidersTests.XMLSerializer_Deserialize_Files_201605 00:00:00 Assert.AreEqual failed. Expected:<<webParts><webPart>[!<![CDATA[web part definition goes here]]></webPart></webParts>>. Actual:<<Contents xmlns="http://schemas.dev.office.com/PnP/2016/05/ProvisioningSchema"><webParts xmlns=""><webPart>[!<![CDATA[web part definition goes here]]></webPart></webParts></Contents>>.
Page 1 of 1

Skipped tests
Result Test      Search Duration Error
OfficeDevPnP.Core.Tests.Authentication.HighTrustAuthenticationTests.CertificateFromStoreAppOnlyAuthenticationTest 00:00:00 Assert.Inconclusive failed. Not enough information to execute this test is passed via the app.config file.
OfficeDevPnP.Core.Tests.Authentication.HighTrustAuthenticationTests.CertificateFileAppOnlyAuthenticationTest 00:00:00 Assert.Inconclusive failed. Not enough information to execute this test is passed via the app.config file.
OfficeDevPnP.Core.Tests.AppModelExtensions.FileFolderExtensionsTests.UploadFileWebDavTest 00:00:00 Assert.Inconclusive failed. Tests involving webdav are not supported when testing using app-only
OfficeDevPnP.Core.Tests.AppModelExtensions.SearchExtensionsTests.TestSiteSearchTest 00:00:00 Assert.Inconclusive failed. Search tests are not supported when testing using app-only
OfficeDevPnP.Core.Tests.AppModelExtensions.SearchExtensionsTests.GetSearchConfigurationFromSiteTest 00:00:00 Assert.Inconclusive failed. Search tests are not supported when testing using app-only
OfficeDevPnP.Core.Tests.AppModelExtensions.SearchExtensionsTests.GetSearchConfigurationFromWebTest 00:00:00 Assert.Inconclusive failed. Search tests are not supported when testing using app-only
OfficeDevPnP.Core.Tests.AppModelExtensions.SearchExtensionsTests.SetSiteCollectionSearchCenterUrlTest 00:00:00 Assert.Inconclusive failed. Search tests are not supported when testing using app-only
OfficeDevPnP.Core.Tests.Framework.Connectors.ConnectorAzureTests.AzureConnectorBackslashSupportTest 00:00:00 Assert.Inconclusive failed. No Azure Storage Key defined in App.Config, so can't test
OfficeDevPnP.Core.Tests.Framework.Connectors.ConnectorAzureTests.AzureConnectorDelete2FolderTest 00:00:00 Assert.Inconclusive failed. No Azure Storage Key defined in App.Config, so can't test
OfficeDevPnP.Core.Tests.Framework.Connectors.ConnectorAzureTests.AzureConnectorDelete2Test 00:00:00 Assert.Inconclusive failed. No Azure Storage Key defined in App.Config, so can't test
Page 1 of 7

Notfound tests
Result Test Duration Error
No data found