Test run details - MTFirstReleaseCredentials - 10/11/2017 6:17:48 PM

Failed Tests | Skipped Tests | Notfound Tests | Passed Tests

Failed tests
Result Test      Search Duration Error
OfficeDevPnP.Core.Tests.AppModelExtensions.FileFolderExtensionsTests.EnsureLibraryFolderPathTest 00:01:40 Initialization method OfficeDevPnP.Core.Tests.AppModelExtensions.FileFolderExtensionsTests.Initialize threw exception. System.Net.WebException: System.Net.WebException: The operation has timed out.
OfficeDevPnP.Core.Tests.AppModelExtensions.FileFolderExtensionsTests.EnsureLibraryRootFolderPathTest 00:01:40 Initialization method OfficeDevPnP.Core.Tests.AppModelExtensions.FileFolderExtensionsTests.Initialize threw exception. System.Net.WebException: System.Net.WebException: The operation has timed out.
OfficeDevPnP.Core.Tests.AppModelExtensions.FileFolderExtensionsTests.EnsureFolderPathTest 00:01:40 Initialization method OfficeDevPnP.Core.Tests.AppModelExtensions.FileFolderExtensionsTests.Initialize threw exception. System.Net.WebException: System.Net.WebException: The operation has timed out.
OfficeDevPnP.Core.Tests.AppModelExtensions.FileFolderExtensionsTests.EnsureWebRootFolderPathTest 00:01:40 Initialization method OfficeDevPnP.Core.Tests.AppModelExtensions.FileFolderExtensionsTests.Initialize threw exception. System.Net.WebException: System.Net.WebException: The operation has timed out.
OfficeDevPnP.Core.Tests.AppModelExtensions.FileFolderExtensionsTests.EnsureLibraryFolderRecursiveTest 00:01:40 Initialization method OfficeDevPnP.Core.Tests.AppModelExtensions.FileFolderExtensionsTests.Initialize threw exception. System.Net.WebException: System.Net.WebException: The operation has timed out.
OfficeDevPnP.Core.Tests.AppModelExtensions.FileFolderExtensionsTests.EnsureLibraryFolderTest 00:01:40 Initialization method OfficeDevPnP.Core.Tests.AppModelExtensions.FileFolderExtensionsTests.Initialize threw exception. System.Net.WebException: System.Net.WebException: The operation has timed out.
OfficeDevPnP.Core.Tests.AppModelExtensions.FileFolderExtensionsTests.EnsureSiteFolderTest 00:01:40 Initialization method OfficeDevPnP.Core.Tests.AppModelExtensions.FileFolderExtensionsTests.Initialize threw exception. System.Net.WebException: System.Net.WebException: The operation has timed out.
OfficeDevPnP.Core.Tests.AppModelExtensions.FileFolderExtensionsTests.GetFileTest 00:01:40 Initialization method OfficeDevPnP.Core.Tests.AppModelExtensions.FileFolderExtensionsTests.Initialize threw exception. System.Net.WebException: System.Net.WebException: The operation has timed out.
OfficeDevPnP.Core.Tests.AppModelExtensions.FileFolderExtensionsTests.SetFilePropertiesTest 00:01:40 Initialization method OfficeDevPnP.Core.Tests.AppModelExtensions.FileFolderExtensionsTests.Initialize threw exception. System.Net.WebException: System.Net.WebException: The operation has timed out.
OfficeDevPnP.Core.Tests.AppModelExtensions.FileFolderExtensionsTests.VerifyIfUploadRequiredTest 00:01:40 Initialization method OfficeDevPnP.Core.Tests.AppModelExtensions.FileFolderExtensionsTests.Initialize threw exception. System.Net.WebException: System.Net.WebException: The operation has timed out.

Notfound tests
Result Test Duration Error
No data found