Test run details - MTFirstReleaseAppOnly - 10/11/2017 3:01:24 AM

Failed Tests | Skipped Tests | Notfound Tests | Passed Tests

Failed tests
Result Test      Search Duration Error
OfficeDevPnP.Core.Tests.Authentication.AuthenticationTests.AzureADAuthFullControlPermissionTest N/A Class Initialization method OfficeDevPnP.Core.Tests.Authentication.AuthenticationTests.ClassInit threw exception. System.NullReferenceException: System.NullReferenceException: Object reference not set to an instance of an object..
OfficeDevPnP.Core.Tests.AppModelExtensions.PageExtensionsTests.CreatedPublishingPagesSetsTitleCorrectlyTest 00:00:00 Test method OfficeDevPnP.Core.Tests.AppModelExtensions.PageExtensionsTests.CreatedPublishingPagesSetsTitleCorrectlyTest threw exception: System.NullReferenceException: Object reference not set to an instance of an object.
OfficeDevPnP.Core.Tests.AppModelExtensions.PageExtensionsTests.CanCreatePublishedPublishingPageWhenModerationIsDisabledTest 00:00:00 Test method OfficeDevPnP.Core.Tests.AppModelExtensions.PageExtensionsTests.CanCreatePublishedPublishingPageWhenModerationIsDisabledTest threw exception: System.NullReferenceException: Object reference not set to an instance of an object.
OfficeDevPnP.Core.Tests.AppModelExtensions.PageExtensionsTests.CanCreatePublishedPublishingPageWhenModerationIsEnabledTest 00:00:00 Test method OfficeDevPnP.Core.Tests.AppModelExtensions.PageExtensionsTests.CanCreatePublishedPublishingPageWhenModerationIsEnabledTest threw exception: System.NullReferenceException: Object reference not set to an instance of an object.
OfficeDevPnP.Core.Tests.AppModelExtensions.PageExtensionsTests.PublishingPageWithInvalidCharsIsCorrectlyCreatedTest 00:00:00 Test method OfficeDevPnP.Core.Tests.AppModelExtensions.PageExtensionsTests.PublishingPageWithInvalidCharsIsCorrectlyCreatedTest threw exception: System.NullReferenceException: Object reference not set to an instance of an object.
OfficeDevPnP.Core.Tests.AppModelExtensions.PageExtensionsTests.CanCreatePublishingPageTest 00:00:00 Test method OfficeDevPnP.Core.Tests.AppModelExtensions.PageExtensionsTests.CanCreatePublishingPageTest threw exception: System.NullReferenceException: Object reference not set to an instance of an object.
OfficeDevPnP.Core.Tests.AppModelExtensions.PageExtensionsTests.ProveThatWeCanAddHtmlToPageAfterChangingLayoutTest 00:00:00 Test method OfficeDevPnP.Core.Tests.AppModelExtensions.PageExtensionsTests.ProveThatWeCanAddHtmlToPageAfterChangingLayoutTest threw exception: System.NullReferenceException: Object reference not set to an instance of an object.
OfficeDevPnP.Core.Tests.AppModelExtensions.PageExtensionsTests.CanAddHtmlToWikiPageTest 00:00:00 Test method OfficeDevPnP.Core.Tests.AppModelExtensions.PageExtensionsTests.CanAddHtmlToWikiPageTest threw exception: System.NullReferenceException: Object reference not set to an instance of an object.
OfficeDevPnP.Core.Tests.AppModelExtensions.PageExtensionsTests.CanAddLayoutToWikiPageTest 00:00:00 Test method OfficeDevPnP.Core.Tests.AppModelExtensions.PageExtensionsTests.CanAddLayoutToWikiPageTest threw exception: System.NullReferenceException: Object reference not set to an instance of an object.
OfficeDevPnP.Core.Tests.AppModelExtensions.PageExtensionsTests.EnsureWikiPageTest 00:00:00 Test method OfficeDevPnP.Core.Tests.AppModelExtensions.PageExtensionsTests.EnsureWikiPageTest threw exception: System.NullReferenceException: Object reference not set to an instance of an object.

Skipped tests
Result Test      Search Duration Error
OfficeDevPnP.Core.Tests.AppModelExtensions.SearchExtensionsTests.TestSiteSearchTest 00:00:00 Assert.Inconclusive failed. Search tests are not supported when testing using app-only
OfficeDevPnP.Core.Tests.AppModelExtensions.SearchExtensionsTests.GetSearchConfigurationFromSiteTest 00:00:00 Assert.Inconclusive failed. Search tests are not supported when testing using app-only
OfficeDevPnP.Core.Tests.AppModelExtensions.SearchExtensionsTests.GetSearchConfigurationFromWebTest 00:00:00 Assert.Inconclusive failed. Search tests are not supported when testing using app-only
OfficeDevPnP.Core.Tests.AppModelExtensions.SearchExtensionsTests.SetSiteCollectionSearchCenterUrlTest 00:00:00 Assert.Inconclusive failed. Search tests are not supported when testing using app-only
OfficeDevPnP.Core.Tests.Framework.ObjectHandlers.ObjectTermGroupsTests.CanProvisionReusableTerms 00:00:00 Assert.Inconclusive failed. Taxonomy tests are not supported when testing using app-only
OfficeDevPnP.Core.Tests.Framework.ObjectHandlers.ObjectTermGroupsTests.CanProvisionObjects 00:00:00 Assert.Inconclusive failed. Taxonomy tests are not supported when testing using app-only
OfficeDevPnP.Core.Tests.Framework.ObjectHandlers.ObjectTermGroupsTests.CanProvisionToSiteCollectionTermGroupUsingToken 00:00:00 Assert.Inconclusive failed. Taxonomy tests are not supported when testing using app-only
OfficeDevPnP.Core.Tests.Framework.Providers.XMLProvidersTests.XMLEncryptionTest 00:00:00 Assert.Inconclusive failed. Missing certificate with SN=PnPTestCertificate in CurrentUser Certificate Store, so can't test
OfficeDevPnP.Core.Tests.Framework.Providers.BaseTemplateTests.DumpSingleTemplate N/A
OfficeDevPnP.Core.Tests.Framework.Providers.BaseTemplateTests.DumpBaseTemplates N/A
Page 1 of 5

Notfound tests
Result Test Duration Error
No data found